BDBM463104 US10780090, Compound I-339::US10780090, Compound I-339a::US10780090, Compound I-339b::[(1R,2S,4R)-2-hydroxy-4-{[5-({4-[(8S)-2-methoxy-5,8-dihydro-6H-pyrano[3,4- b]pyridin-8-yl]-5-methyl-2-thienyl}carbonyl)pyrimidin-4-yl]amino}cyclopentyl]methyl sulfamate
SMILES COc1ccc2CCO[C@@H](c3cc(sc3C)C(=O)c3cncnc3N[C@H]3C[C@H](O)[C@@H](COS(N)(=O)=O)C3)c2n1
InChI Key InChIKey=ASDLZGAVSYCXHI-NLFPWZOASA-N
Data  3 IC50
  Tab Delimited (TSV)   2D SDfile   Computed 3D by Vconf -m prep SDfile
Find this compound or compounds like it in BindingDB:
Activity Spreadsheet -- Enzyme Inhibition Constant Data from BindingDB
Found 3 hits for monomerid = 463104
TargetSUMO-activating enzyme subunit 1(Homo sapiens (Human))
Millennium Pharmaceuticals
US Patent
LigandPNGBDBM463104(US10780090, Compound I-339 | US10780090, Compound ...)
Affinity DataIC50: <10nM. Assay description: The SAE enzymatic reaction totals 50 μl and contains 50 mM HEPES Hemisodium (pH 7.5), 0.05% BSA, 5 mM MgCl2, 0.5 μM ATP, 250 μM GSH, 0...
Ligand InfoPC cidPC sid
In DepthDetails US Patent
TargetSUMO-activating enzyme subunit 1(Homo sapiens (Human))
Millennium Pharmaceuticals
US Patent
LigandPNGBDBM463104(US10780090, Compound I-339 | US10780090, Compound ...)
Affinity DataIC50: <10nM. Assay description: The SAE enzymatic reaction totals 50 μl and contains 50 mM HEPES Hemisodium (pH 7.5), 0.05% BSA, 5 mM MgCl2, 0.5 μM ATP, 250 μM GSH, 0...
Ligand InfoPC cidPC sid
In DepthDetails US Patent
TargetSUMO-activating enzyme subunit 1(Homo sapiens (Human))
Millennium Pharmaceuticals
US Patent
LigandPNGBDBM463104(US10780090, Compound I-339 | US10780090, Compound ...)
Affinity DataIC50: <10nM. Assay description: The SAE enzymatic reaction totals 50 μl and contains 50 mM HEPES Hemisodium (pH 7.5), 0.05% BSA, 5 mM MgCl2, 0.5 μM ATP, 250 μM GSH, 0...
Ligand InfoPC cidPC sid
In DepthDetails US Patent