BDBM463162 4-Amino-5-(4-chloro-3-fluoro-5- hydroxyphenyl)-2-{8-[(3,5- difluorophenyl)methyl]imidazo[1, 2-a]pyrazin-6-yl}-5-methyl-5,7- dihydro-6H-pyrrolo[2,3- d]pyrimidin-6-one::US10780092, Example 16-B
SMILES CC1(C(=O)Nc2nc(nc(N)c12)-c1cn2ccnc2c(Cc2cc(F)cc(F)c2)n1)c1cc(O)c(Cl)c(F)c1
InChI Key InChIKey=VDVKLWJLYKYHBD-UHFFFAOYSA-N
Data  1 KI
  Tab Delimited (TSV)   2D SDfile   Computed 3D by Vconf -m prep SDfile
Find this compound or compounds like it in BindingDB:
Activity Spreadsheet -- Enzyme Inhibition Constant Data from BindingDB
Found 1 hit for monomerid = 463162
TargetGuanylate cyclase soluble subunit alpha-1(Homo sapiens (Human))
Merck Sharp & Dohme
US Patent
LigandPNGBDBM463162(4-Amino-5-(4-chloro-3-fluoro-5- hydroxyphenyl)-2-{...)
Affinity DataKi:  0.158nM. Assay description: The binding potencies of sGC compounds to the human recombinant sGC enzyme were determined in a Size Exclusion Chromatography (SEC) competition bindi...
Ligand InfoPC cidPC sid
In DepthDetails US Patent