BDBM46322 (4E)-2-methoxy-4-[(5H-[1,2,4]triazino[5,6-b]indol-3-ylhydrazo)methylidene]-1-cyclohexa-2,5-dienone::(4E)-2-methoxy-4-[[2-(5H-[1,2,4]triazino[5,6-b]indol-3-yl)hydrazinyl]methylidene]cyclohexa-2,5-dien-1-one::(4E)-2-methoxy-4-[[N'-(5H-[1,2,4]triazin[5,6-b]indol-3-yl)hydrazino]methylene]cyclohexa-2,5-dien-1-one::2-Methoxy-4-[(9H-1,3,4,9-tetraaza-fluoren-2-yl)-hydrazonomethyl]-phenol::MLS000554463::SMR000171289::cid_5722242
SMILES COc1cc(CN=Nc2nnc3c(n2)[nH]c2ccccc32)ccc1O
InChI Key InChIKey=XIMFMGROMGJLRI-UHFFFAOYSA-N
Data  1 IC50  1 EC50
  Tab Delimited (TSV)   2D SDfile   Computed 3D by Vconf -m prep SDfile
Find this compound or compounds like it in BindingDB:
Activity Spreadsheet -- Enzyme Inhibition Constant Data from BindingDB
Found 2 hits for monomerid = 46322
TargetInduced myeloid leukemia cell differentiation protein Mcl-1(Homo sapiens (Human))
Emory University
Curated by PubChem BioAssay
LigandPNGBDBM46322((4E)-2-methoxy-4-[(5H-[1,2,4]triazino[5,6-b]indol-...)
Affinity DataIC50:  3.90E+3nM. Assay description: NIH Molecular Libraries Screening Centers Network [MLSCN] Emory Chemical Biology Discovery Center in MLSCN Assay provider: Nikolovska-Coleska, Univer...
In DepthDetails PCBioAssay
LigandPNGBDBM46322((4E)-2-methoxy-4-[(5H-[1,2,4]triazino[5,6-b]indol-...)
Affinity DataEC50:  634nM. Assay description: University of New Mexico Assay Overview: Assay Support: NIH I RO3 MH081231-01 HTS to identify specific small molecule inhibitors of Ras and Ras-rela...
In DepthDetails PCBioAssay