BDBM463245 4-Amino-5-(4-chloro-3- hydroxyphenyl)-2-{8-[(3- fluorophenyl)methyl]-2- methylimidazo[1,2-a]pyrazin-6- yl}-5-methyl-5,7-dihydro-6H- pyrrolo[2,3-d]pyrimidin-6-one::US10780092, Example 99-A
SMILES Cc1cn2cc(nc(Cc3cccc(F)c3)c2n1)-c1nc2NC(=O)C(C)(c2c(N)n1)c1ccc(Cl)c(O)c1
InChI Key InChIKey=XYCIRMPOEOXKSC-UHFFFAOYSA-N
Data  1 KI
  Tab Delimited (TSV)   2D SDfile   Computed 3D by Vconf -m prep SDfile
Find this compound or compounds like it in BindingDB:
Activity Spreadsheet -- Enzyme Inhibition Constant Data from BindingDB
Found 1 hit for monomerid = 463245
TargetGuanylate cyclase soluble subunit alpha-1(Homo sapiens (Human))
Merck Sharp & Dohme
US Patent
LigandPNGBDBM463245(4-Amino-5-(4-chloro-3- hydroxyphenyl)-2-{8-[(3- fl...)
Affinity DataKi:  0.803nM. Assay description: The binding potencies of sGC compounds to the human recombinant sGC enzyme were determined in a Size Exclusion Chromatography (SEC) competition bindi...
Ligand InfoPC cidPC sid
In DepthDetails US Patent