BDBM463263 4-Amino-5-(3-fluoro-4- hydroxyphenyl)-5- methyl-2-(8-(3,3,4,4,4- pentafluorobutyl)- [1,2,4]triazolo[1,5-a] pyrazin-6-yl)-5,7- dihydro-6H-pyrrolo- [2,3-d]pyrimidin-6-one::US10780092, Example 116-B
SMILES CC1(C(=O)Nc2nc(nc(N)c12)-c1cn2ncnc2c(CCC(F)(F)C(F)(F)F)n1)c1ccc(O)c(F)c1
InChI Key InChIKey=IAWCYNIHAQZTQD-UHFFFAOYSA-N
Data  1 KI
  Tab Delimited (TSV)   2D SDfile   Computed 3D by Vconf -m prep SDfile
Find this compound or compounds like it in BindingDB:
Activity Spreadsheet -- Enzyme Inhibition Constant Data from BindingDB
Found 1 hit for monomerid = 463263
TargetGuanylate cyclase soluble subunit alpha-1(Homo sapiens (Human))
Merck Sharp & Dohme
US Patent
LigandPNGBDBM463263(4-Amino-5-(3-fluoro-4- hydroxyphenyl)-5- methyl-2-...)
Affinity DataKi:  6.38nM. Assay description: The binding potencies of sGC compounds to the human recombinant sGC enzyme were determined in a Size Exclusion Chromatography (SEC) competition bindi...
Ligand InfoPC cidPC sid
In DepthDetails US Patent