BDBM46329 1,3-dimethyl-2-oxidanylidene-perimidine-6-carbaldehyde::1,3-dimethyl-2-oxo-2,3-dihydro-1H-perimidine-6-carbaldehyde::1,3-dimethyl-2-oxo-6-perimidinecarboxaldehyde::1,3-dimethyl-2-oxoperimidine-6-carbaldehyde::2-keto-1,3-dimethyl-perimidine-6-carbaldehyde::MLS000624980::SMR000293751::cid_919421
SMILES Cn1c2cccc3c(C=O)ccc(n(C)c1=O)c23
InChI Key InChIKey=PPDWWDSHIJMHKW-UHFFFAOYSA-N
Data  1 IC50  1 EC50
  Tab Delimited (TSV)   2D SDfile   Computed 3D by Vconf -m prep SDfile
Find this compound or compounds like it in BindingDB:
Activity Spreadsheet -- Enzyme Inhibition Constant Data from BindingDB
Found 2 hits for monomerid = 46329
TargetGlycoprotein 42(Human herpesvirus 4 type 2)
Emory University
Curated by PubChem BioAssay
LigandPNGBDBM46329(1,3-dimethyl-2-oxidanylidene-perimidine-6-carbalde...)
Affinity DataIC50:  3.67E+3nM. Assay description: NIH Molecular Libraries Screening Centers Network [MLSCN] Emory Chemical Biology Discovery Center in MLSCN Assay provider: Theodore Jardetzky; Northw...
In DepthDetails PCBioAssay
LigandPNGBDBM46329(1,3-dimethyl-2-oxidanylidene-perimidine-6-carbalde...)
Affinity DataEC50:  2.08E+4nM. Assay description: University of New Mexico Assay Overview: Assay Support: NIH I RO3 MH081231-01 HTS to identify specific small molecule inhibitors of Ras and Ras-rela...
In DepthDetails PCBioAssay