BDBM463303 (-)-(2R)-1-(2-Methoxybenzyl)- N-(9-chloro-3,4-dihydro-2H- 1,5-benzodioxepin-7- ylmethyl)-N- isobutylmorpholine-2- carboxamide::US10780095, Structure TABLE 1.1
SMILES COc1ccccc1CN1CCOC(C1)C(=O)N(CC(C)C)Cc1cc(Cl)c2OCCCOc2c1
InChI Key InChIKey=UKXMQUPBBJMFEQ-UHFFFAOYSA-N
Data  1 KI
  Tab Delimited (TSV)   2D SDfile   Computed 3D by Vconf -m prep SDfile
Find this compound or compounds like it in BindingDB:
Activity Spreadsheet -- Enzyme Inhibition Constant Data from BindingDB
Found 1 hit for monomerid = 463303
TargetProkineticin receptor 1(Homo sapiens (Human))
The Regents Of The University Of California
US Patent
LigandPNGBDBM463303((-)-(2R)-1-(2-Methoxybenzyl)- N-(9-chloro-3,4-dihy...)
Affinity DataKi:  1.49nM. Assay description: An aequorin-based luminescent assay for calcium mobilization was used to measure mobilization of intracellular Ca2+ (Bullock et al., Mol Pharmacol 65...
Ligand InfoPC cidPC sid
In DepthDetails US Patent