BDBM463448 3-Morpholino-2-phenylquinoxaline-6-carboxylic acid::US10781185, Example 16::US11459307, Example 16
SMILES OC(=O)c1ccc2nc(-c3ccccc3)c(nc2c1)N1CCOCC1
InChI Key InChIKey=RVIHPCCTLCBNIH-UHFFFAOYSA-N
Data  4 IC50
  Tab Delimited (TSV)   2D SDfile   Computed 3D by Vconf -m prep SDfile
Find this compound or compounds like it in BindingDB:
Activity Spreadsheet -- Enzyme Inhibition Constant Data from BindingDB
Found 4 hits for monomerid = 463448
TargetPAS domain-containing serine/threonine-protein kinase(Homo sapiens (Human))
Bioenergenix
US Patent
LigandPNGBDBM463448(3-Morpholino-2-phenylquinoxaline-6-carboxylic acid...)
Affinity DataIC50: <1.00E+3nM. Assay description: Purified hPASK from insect cells (0.02 μg) is added to a 50 μL reaction mix containing 40 mM HEPES (pH 7.0), 100 mM KCl, 5 mM MgCl2, 1 mM D...
Ligand InfoPC cidPC sid
In DepthDetails US Patent
TargetPAS domain-containing serine/threonine-protein kinase [879-1323](Homo sapiens (Human))
Bioenergenix
US Patent
LigandPNGBDBM463448(3-Morpholino-2-phenylquinoxaline-6-carboxylic acid...)
Affinity DataIC50: <1.00E+4nM. Assay description: Purified PASK (UniProt #Q96RG2; human recombinant N-terminal GST tagged construct, residues 879-1323) from insect cells (final concentration 5 nM) is...
Ligand InfoPC cidPC sid
In DepthDetails US Patent
TargetPAS domain-containing serine/threonine-protein kinase(Homo sapiens (Human))
Bioenergenix
US Patent
LigandPNGBDBM463448(3-Morpholino-2-phenylquinoxaline-6-carboxylic acid...)
Affinity DataIC50: <1.00E+4nM. Assay description: One assay for purified hPASK activity utilizes the Kinase-Glo Luminescent Kinase Assay (Promega), which quantifies the amount of ATP remaining in sol...
Ligand InfoPC cidPC sid
In DepthDetails US Patent
TargetPAS domain-containing serine/threonine-protein kinase(Homo sapiens (Human))
Bioenergenix
US Patent
LigandPNGBDBM463448(3-Morpholino-2-phenylquinoxaline-6-carboxylic acid...)
Affinity DataIC50: <1.00E+3nM. Assay description: Purified PASK (UniProt # Q96RG2; human recombinant N-terminal GST tagged construct, residues 879-1323) from insect cells (final concentration 5 nM) i...
Ligand InfoPC cidPC sid
In DepthDetails US Patent