BDBM463487 (R)-2-Phenyl-3-(2-(trifluoromethyl)pyrrolidin-1-yl)quinoxaline-6-carboxylic acid::US10781185, Example 65::US11459307, Example 65
SMILES OC(=O)c1ccc2nc(-c3ccccc3)c(nc2c1)N1CCC[C@@H]1C(F)(F)F
InChI Key InChIKey=UZOQISATLXPBPB-MRXNPFEDSA-N
Data  4 IC50
  Tab Delimited (TSV)   2D SDfile   Computed 3D by Vconf -m prep SDfile
Find this compound or compounds like it in BindingDB:
Activity Spreadsheet -- Enzyme Inhibition Constant Data from BindingDB
Found 4 hits for monomerid = 463487
TargetPAS domain-containing serine/threonine-protein kinase(Homo sapiens (Human))
Bioenergenix
US Patent
LigandPNGBDBM463487((R)-2-Phenyl-3-(2-(trifluoromethyl)pyrrolidin-1-yl...)
Affinity DataIC50: <1.00E+3nM. Assay description: Purified PASK (UniProt # Q96RG2; human recombinant N-terminal GST tagged construct, residues 879-1323) from insect cells (final concentration 5 nM) i...
Ligand InfoPC cidPC sid
In DepthDetails US Patent
TargetPAS domain-containing serine/threonine-protein kinase(Homo sapiens (Human))
Bioenergenix
US Patent
LigandPNGBDBM463487((R)-2-Phenyl-3-(2-(trifluoromethyl)pyrrolidin-1-yl...)
Affinity DataIC50: <1.00E+4nM. Assay description: The aim of the FRET assay is to determine the inhibition potential of test compounds on targeted kinase. This assay platform provides a homogenous sc...
Ligand InfoPC cidPC sid
In DepthDetails US Patent
TargetPAS domain-containing serine/threonine-protein kinase [879-1323](Homo sapiens (Human))
Bioenergenix
US Patent
LigandPNGBDBM463487((R)-2-Phenyl-3-(2-(trifluoromethyl)pyrrolidin-1-yl...)
Affinity DataIC50: <1.00E+4nM. Assay description: Purified PASK (UniProt #Q96RG2; human recombinant N-terminal GST tagged construct, residues 879-1323) from insect cells (final concentration 5 nM) is...
Ligand InfoPC cidPC sid
In DepthDetails US Patent
TargetPAS domain-containing serine/threonine-protein kinase(Homo sapiens (Human))
Bioenergenix
US Patent
LigandPNGBDBM463487((R)-2-Phenyl-3-(2-(trifluoromethyl)pyrrolidin-1-yl...)
Affinity DataIC50: <1.00E+3nM. Assay description: Compound screening was done via the following method. 10 mM stock solution of test compound in DMSO was prepared by dissolving test compound in DMSO ...
Ligand InfoPC cidPC sid
In DepthDetails US Patent