BDBM463558 (2S)-3-[(3S,4S)- 3-[(1R)-1- hydroxyethyl]-4- {4-methoxy-3- [(1-pyridin-4- ylazetidin-3- yl)oxy]phenyl}- 3- methylpyrrolidin- 1-yl]-3- oxopropane-1,2- diol::US10781202, Example 3
SMILES COc1ccc(cc1OC1CN(C1)c1ccncc1)[C@@H]1CN(C[C@@]1(C)[C@@H](C)O)C(=O)[C@@H](O)CO
InChI Key InChIKey=HCHCQQWWBIFLAQ-AQVRWDIJSA-N
Data  1 IC50
  Tab Delimited (TSV)   2D SDfile   Computed 3D by Vconf -m prep SDfile
Find this compound or compounds like it in BindingDB:
Activity Spreadsheet -- Enzyme Inhibition Constant Data from BindingDB
Found 1 hit for monomerid = 463558
TargetcAMP-specific 3',5'-cyclic phosphodiesterase 4B(Homo sapiens (Human))
Eli Lilly
US Patent
LigandPNGBDBM463558((2S)-3-[(3S,4S)- 3-[(1R)-1- hydroxyethyl]-4- {4-me...)
Affinity DataIC50:  7.70nM. Assay description:  PDE4A, PDE4B, PDE4C, PDE4D, and PDE5 human recombinant proteins are expressed and purified from Saccharomyes cerevisiae that lack endogenous PDEs. T...
Ligand InfoPC cidPC sid
In DepthDetails US Patent