BDBM463647 US10781204, Compound I-126::US11434240, Compound I-126
SMILES NC(=O)[C@H]1CCCN(C1)c1ccn(n1)-c1cc(nc2CNC(=O)c12)-c1c(F)cccc1C#N
InChI Key InChIKey=PFPRJWRJJSOQED-AWEZNQCLSA-N
Data  4 KI
  Tab Delimited (TSV)   2D SDfile   Computed 3D by Vconf -m prep SDfile
Find this compound or compounds like it in BindingDB:
Activity Spreadsheet -- Enzyme Inhibition Constant Data from BindingDB
Found 4 hits for monomerid = 463647
TargetNon-receptor tyrosine-protein kinase TYK2(Homo sapiens (Human))
Nimbus Lakshmi
US Patent
LigandPNGBDBM463647(US10781204, Compound I-126 | US11434240, Compound ...)
Affinity DataKi:  5nM. Assay description: Peptide substrate, [KKSRGDYMTMQIG], (20 μM) is prepared in reaction buffer (20 mM Hepes pH 7.5, 10 mM MgCl2, 1 mM EGTA, 0.02% Brij35, 0.02 mg/mL...
Ligand InfoPC cidPC sid
In DepthDetails US Patent
TargetNon-receptor tyrosine-protein kinase TYK2(Homo sapiens (Human))
Nimbus Lakshmi
US Patent
LigandPNGBDBM463647(US10781204, Compound I-126 | US11434240, Compound ...)
Affinity DataKi:  5nM. Assay description: The caliper machine employs an off chip mobility shift assay to detect phosphorylated peptide substrates from kinase assays, using microfluidics tech...
Ligand InfoPC cidPC sid
In DepthDetails US Patent
TargetTyrosine-protein kinase JAK2(Homo sapiens (Human))
Nimbus Lakshmi
US Patent
LigandPNGBDBM463647(US10781204, Compound I-126 | US11434240, Compound ...)
Affinity DataKi:  55nM. Assay description: Peptide substrate, [KKSRGDYMTMQIG], (20 μM) is prepared in reaction buffer (20 mM Hepes pH 7.5, 10 mM MgCl2, 1 mM EGTA, 0.02% Brij35, 0.02 mg/mL...
Ligand InfoPC cidPC sid
In DepthDetails US Patent
TargetTyrosine-protein kinase JAK2(Homo sapiens (Human))
Nimbus Lakshmi
US Patent
LigandPNGBDBM463647(US10781204, Compound I-126 | US11434240, Compound ...)
Affinity DataKi:  55nM. Assay description: The caliper machine employs an off chip mobility shift assay to detect phosphorylated peptide substrates from kinase assays, using microfluidics tech...
Ligand InfoPC cidPC sid
In DepthDetails US Patent