BDBM463767 US10787419, Compound 12
SMILES Clc1ccc(cc1)C1=NN(CC1c1ccccc1)C(\NC(=N)c1ccncc1)=N\S(=O)(=O)c1ccc(Cl)cc1
InChI Key InChIKey=WVHZGUYNBRNCET-UHFFFAOYSA-N
Data  1 KI
  Tab Delimited (TSV)   2D SDfile   Computed 3D by Vconf -m prep SDfile
Find this compound or compounds like it in BindingDB:
Activity Spreadsheet -- Enzyme Inhibition Constant Data from BindingDB
Found 1 hit for monomerid = 463767
TargetCannabinoid receptor 1(Mus musculus (Mouse))
The United States Of America, As Represented By The Secretary, Department Of Health And Human Services
US Patent
LigandPNGBDBM463767(US10787419, Compound 12)
Affinity DataKi:  34nM. Assay description: Measuring its tissue levels 1 hour after administration of 10 mg/kg to mice, plasma levels were comparable after oral or i.p. administration (indicat...
Ligand InfoPC cidPC sid
In DepthDetails US Patent