BDBM463916 US10787425, Compound 43
SMILES COc1cc(\C=C2/SC(=O)NC2=O)ccc1OC(=O)CCc1ccccc1
InChI Key InChIKey=IROOLMBIIXATSJ-ATVHPVEESA-N
Data  1 IC50
  Tab Delimited (TSV)   2D SDfile   Computed 3D by Vconf -m prep SDfile
Find this compound or compounds like it in BindingDB:
Activity Spreadsheet -- Enzyme Inhibition Constant Data from BindingDB
Found 1 hit for monomerid = 463916
Target15-hydroxyprostaglandin dehydrogenase [NAD(+)](Homo sapiens (Human))
Industry-Academic Cooperation Foundation Chosun University
US Patent
LigandPNGBDBM463916(US10787425, Compound 43)
Affinity DataIC50:  28.6nM. Assay description: To confirm whether the compounds according to the present disclosure have an effect of inhibiting 15-PGDH, the NADH, which appears at the wavelength ...
Ligand InfoPC cidPC sid
In DepthDetails US Patent