BDBM463986 US10787434, Example 4
SMILES CCOc1nc(ccc1C(=O)NC[C@@H](O)[C@@H]1Cc2ccccc2CN1)N1CCN(CC1)C(C)=O
InChI Key InChIKey=JXTKLVOCKGMTME-FCHUYYIVSA-N
Data  1 IC50
  Tab Delimited (TSV)   2D SDfile   Computed 3D by Vconf -m prep SDfile
Find this compound or compounds like it in BindingDB:
Activity Spreadsheet -- Enzyme Inhibition Constant Data from BindingDB
Found 1 hit for monomerid = 463986
TargetProtein arginine N-methyltransferase 5(Homo sapiens (Human))
Ctxt
US Patent
LigandPNGBDBM463986(US10787434, Example 4)
Affinity DataIC50:  26nM. Assay description: The 6 μL reactions are run in Greiner brand black 384-well low volume assay plates. All reactions contained assay buffer (phosphate buffered sal...
Ligand InfoPC cidPC sid
In DepthDetails US Patent