BDBM464116 US10787436, Compound I-61
SMILES CN(C)C\C=C\C(=O)Nc1ccc(cc1)C(=O)Nc1cccc(Nc2ncc(Cl)c(n2)-c2ccc3n(C)ccc3c2)c1
InChI Key InChIKey=QYFYSDHOBJHFRT-VMPITWQZSA-N
Data  1 IC50
  Tab Delimited (TSV)   2D SDfile   Computed 3D by Vconf -m prep SDfile
Find this compound or compounds like it in BindingDB:
Activity Spreadsheet -- Enzyme Inhibition Constant Data from BindingDB
Found 1 hit for monomerid = 464116
TargetCyclin-H/Cyclin-dependent kinase 7(Homo sapiens (Human))
Dana-Farber Cancer Institute
US Patent
LigandPNGBDBM464116(US10787436, Compound I-61)
Affinity DataIC50:  550nM. Assay description: In vitro kinase assays with immunoprecipitated proteins (or recombinant CAK complexes) were performed as follows. Kinase reactions were performed in ...
Ligand InfoPC cidPC sid
In DepthDetails US Patent