BDBM464306 3-(6-ethyl-5-(1H- pyrazol-4-yl)pyridin- 2-yl)-1-(3-fluoro-5- methoxybenzyl)-8-(2- hydroxypropanoyl)- 1,3,8- triazaspiro[4.5]decan- 2-one::US10787450, Example 188
SMILES CCc1nc(ccc1-c1cn[nH]c1)N1CC2(CCN(CC2)C(=O)C(C)O)N(Cc2cc(F)cc(OC)c2)C1=O
InChI Key
Data  1 IC50
  Tab Delimited (TSV)   2D SDfile   Computed 3D by Vconf -m prep SDfile
Find this compound or compounds like it in BindingDB:
Activity Spreadsheet -- Enzyme Inhibition Constant Data from BindingDB
Found 1 hit for monomerid = 464306
TargetRho-associated protein kinase 2(Homo sapiens (Human))
Bristol-Myers Squibb
US Patent
LigandPNGBDBM464306(3-(6-ethyl-5-(1H- pyrazol-4-yl)pyridin- 2-yl)-1-(3...)
Affinity DataIC50: <3nM. Assay description: The effectiveness of compounds of the present invention as ROCK inhibitors can be determined in a 30 μL assay containing 20 mM HEPES, pH 7.5, 20...
Ligand InfoPC cidPC sid
In DepthDetails US Patent