BDBM464402 US10793514, Compound 6
SMILES COc1ccc(Oc2ccccc2CN(CC[C@@H](N)C(O)=O)Cc2ccccc2Oc2ccc(OC)cc2)cc1
InChI Key InChIKey=ZGKLOMPLPGZQFL-GDLZYMKVSA-N
Data  2 IC50
  Tab Delimited (TSV)   2D SDfile   Computed 3D by Vconf -m prep SDfile
Find this compound or compounds like it in BindingDB:
Activity Spreadsheet -- Enzyme Inhibition Constant Data from BindingDB
Found 2 hits for monomerid = 464402
TargetAmino acid transporter(Rattus norvegicus)
Vanderbilt University
US Patent
LigandPNGBDBM464402(US10793514, Compound 6)
Affinity DataIC50:  1.19E+4nM. Assay description: Live-cell amino acid uptake assays using HEK293 cells were carried out in 96-well plates (CulturPlate-96, Perkin Elmer). 96-well plates were coated w...
Ligand InfoPC cidPC sid
In DepthDetails US Patent
TargetNeutral amino acid transporter B(0)(Homo sapiens (Human))
Vanderbilt University
US Patent
LigandPNGBDBM464402(US10793514, Compound 6)
Affinity DataIC50:  8.70E+3nM. Assay description: Live-cell amino acid uptake assays using HEK293 cells were carried out in 96-well plates (CulturPlate-96, Perkin Elmer). 96-well plates were coated w...
Ligand InfoPC cidPC sid
In DepthDetails US Patent