BDBM464408 US10793514, Compound 12
SMILES COc1cccc(COc2ccccc2CN(CC[C@@H](N)C(O)=O)Cc2ccccc2OCc2cccc(OC)c2)c1
InChI Key InChIKey=DVPGIFOQXACXCT-WJOKGBTCSA-N
Data  2 IC50
  Tab Delimited (TSV)   2D SDfile   Computed 3D by Vconf -m prep SDfile
Find this compound or compounds like it in BindingDB:
Activity Spreadsheet -- Enzyme Inhibition Constant Data from BindingDB
Found 2 hits for monomerid = 464408
TargetAmino acid transporter(Rattus norvegicus)
Vanderbilt University
US Patent
LigandPNGBDBM464408(US10793514, Compound 12)
Affinity DataIC50:  7.20E+3nM. Assay description: Live-cell amino acid uptake assays using HEK293 cells were carried out in 96-well plates (CulturPlate-96, Perkin Elmer). 96-well plates were coated w...
Ligand InfoPC cidPC sid
In DepthDetails US Patent
TargetNeutral amino acid transporter B(0)(Homo sapiens (Human))
Vanderbilt University
US Patent
LigandPNGBDBM464408(US10793514, Compound 12)
Affinity DataIC50:  5.10E+3nM. Assay description: Live-cell amino acid uptake assays using HEK293 cells were carried out in 96-well plates (CulturPlate-96, Perkin Elmer). 96-well plates were coated w...
Ligand InfoPC cidPC sid
In DepthDetails US Patent