BDBM464473 US10793528, Example SC_5043
SMILES COCCCN1C(=O)N(CCC(=O)NCC(N)=O)C[C@]11CC[C@@](CC1)(N(C)C)c1ccccc1
InChI Key InChIKey=RQVJFABWBLBKOD-PLQXJYEYSA-N
Data  2 KI
  Tab Delimited (TSV)   2D SDfile   Computed 3D by Vconf -m prep SDfile
Find this compound or compounds like it in BindingDB:
Activity Spreadsheet -- Enzyme Inhibition Constant Data from BindingDB
Found 2 hits for monomerid = 464473
TargetPrepronociceptin(Human)
GrÜNenthal
US Patent
LigandPNGBDBM464473(US10793528, Example SC_5043)
Affinity DataKi:  101nM. Assay description: NOP:The hNOP receptor binding assay was performed as homogeneous SPA-assay (scintillation proximity assay) using the assay buffer 50 mM TRIS-HCl. 10 ...
Ligand InfoPC cidPC sid
In DepthDetails US Patent
TargetMu-type opioid receptor(Homo sapiens (Human))
GrÜNenthal
US Patent
LigandPNGBDBM464473(US10793528, Example SC_5043)
Affinity DataKi:  210nM. Assay description: MOP: The hMOP receptor binding assay was performed as homogeneous SPA-assay (scintillation proximity assay) using the assay buffer 50 mM TRIS-HCl (pH...
Ligand InfoPC cidPC sid
In DepthDetails US Patent