BDBM464492 Compound 1-9::US11072585, Example 2
SMILES CCN(C)[C@]1(CC[C@]2(CN(CC(C)(C)C(N)=O)C(=O)N2C)CC1)c1ccccc1
InChI Key InChIKey=UBTGLYHAJPYFPU-ZRZAMGCNSA-N
Data  1 IC50
  Tab Delimited (TSV)   2D SDfile   Computed 3D by Vconf -m prep SDfile
Find this compound or compounds like it in BindingDB:
Activity Spreadsheet -- Enzyme Inhibition Constant Data from BindingDB
Found 1 hit for monomerid = 464492
TargetLysyl oxidase homolog 2(Homo sapiens (Human))
Pharmakea
US Patent
LigandPNGBDBM464492(Compound 1-9 | US11072585, Example 2)
Affinity DataIC50: <300nM. Assay description: LOXL2 amine oxidase activity is evaluated by measuring Amplex Red fluorescence using 10-20× concentrated conditioned media from CHO cells stably expr...
Ligand InfoPC cidPC sid
In DepthDetails US Patent