BDBM464523 US10793549, Compound G-9
SMILES Cc1cn(c2cc(cc(C(=O)NCc3c(C)cc(C)[nH]c3=O)c12)-c1ccc(N)nc1)S(=O)(=O)C1(CC=C)CC1
InChI Key InChIKey=NGJOFEAFUUWSPF-UHFFFAOYSA-N
Data  1 IC50
  Tab Delimited (TSV)   2D SDfile   Computed 3D by Vconf -m prep SDfile
Find this compound or compounds like it in BindingDB:
Activity Spreadsheet -- Enzyme Inhibition Constant Data from BindingDB
Found 1 hit for monomerid = 464523
TargetHistone-lysine N-methyltransferase EZH2 [Y641F]/Polycomb protein EED/Polycomb protein SUZ12(Homo sapiens (Human))
Shanghai Haiyan Pharmaceutical Technology
US Patent
LigandPNGBDBM464523(US10793549, Compound G-9)
Affinity DataIC50:  35nM. Assay description: Recombinant PRC2 (EZH2-Y641F) was purchased from Active motif company, S-adenosyl-methionine (SAM) and Poly-L-lysine (PLL) were purchased from Sigma-...
Ligand InfoPC cidPC sid
In DepthDetails US Patent