BDBM464530 US10793549, Compound G-16
SMILES CN(C)Cc1ccc(cc1F)-c1cc(C(=O)NCc2c(C)cc(C)[nH]c2=O)c2c(C)cn(c2c1)S(=O)(=O)C1(CC=C)CC1
InChI Key InChIKey=LRPCDMLAUKUYGC-UHFFFAOYSA-N
Data  1 IC50
  Tab Delimited (TSV)   2D SDfile   Computed 3D by Vconf -m prep SDfile
Find this compound or compounds like it in BindingDB:
Activity Spreadsheet -- Enzyme Inhibition Constant Data from BindingDB
Found 1 hit for monomerid = 464530
TargetHistone-lysine N-methyltransferase EZH2 [Y641F]/Polycomb protein EED/Polycomb protein SUZ12(Homo sapiens (Human))
Shanghai Haiyan Pharmaceutical Technology
US Patent
LigandPNGBDBM464530(US10793549, Compound G-16)
Affinity DataIC50:  23nM. Assay description: Recombinant PRC2 (EZH2-Y641F) was purchased from Active motif company, S-adenosyl-methionine (SAM) and Poly-L-lysine (PLL) were purchased from Sigma-...
Ligand InfoPC cidPC sid
In DepthDetails US Patent