BDBM46477 1-(3,4-dimethoxyphenyl)-2-phenyl-ethanone::1-(3,4-dimethoxyphenyl)-2-phenylethanone::MLS000699529::SMR000230287::cid_678663
SMILES COc1ccc(cc1OC)C(=O)Cc1ccccc1
InChI Key InChIKey=PCHUBNOSEWYQAT-UHFFFAOYSA-N
Data  2 EC50
  Tab Delimited (TSV)   2D SDfile   Computed 3D by Vconf -m prep SDfile
Find this compound or compounds like it in BindingDB:
Activity Spreadsheet -- Enzyme Inhibition Constant Data from BindingDB
Found 2 hits for monomerid = 46477
TargetEukaryotic translation initiation factor 2-alpha kinase 3(Homo sapiens (Human))
The Scripps Research Institute Molecular Screening Center
Curated by PubChem BioAssay
LigandPNGBDBM46477(1-(3,4-dimethoxyphenyl)-2-phenyl-ethanone | 1-(3,4...)
Affinity DataEC50: >5.57E+4nM. Assay description: Source (MLPCN Center Name): The Scripps Research Institute Molecular Screening Center (SRIMSC) Center Affiliation: The Scripps Research Institute (TS...
In DepthDetails PCBioAssay
TargetEukaryotic translation initiation factor 2-alpha kinase 3(Homo sapiens (Human))
The Scripps Research Institute Molecular Screening Center
Curated by PubChem BioAssay
LigandPNGBDBM46477(1-(3,4-dimethoxyphenyl)-2-phenyl-ethanone | 1-(3,4...)
Affinity DataEC50: >5.57E+4nM. Assay description: Source (MLPCN Center Name): The Scripps Research Institute Molecular Screening Center (SRIMSC) Center Affiliation: The Scripps Research Institute (TS...
In DepthDetails PCBioAssay