BDBM464788 US10793563, Compound I-202
SMILES NC(=O)C1CN(CC(F)(F)C1)c1ccnc(n1)-c1cnc2ccc(cn12)C(F)(F)F
InChI Key InChIKey=ILGGXNFHZBKNLG-UHFFFAOYSA-N
Data  1 KI  1 IC50
  Tab Delimited (TSV)   2D SDfile   Computed 3D by Vconf -m prep SDfile
Find this compound or compounds like it in BindingDB:
Activity Spreadsheet -- Enzyme Inhibition Constant Data from BindingDB
Found 2 hits for monomerid = 464788
TargeteIF-2-alpha kinase GCN2(Homo sapiens (Human))
Merck Patent
US Patent
LigandPNGBDBM464788(US10793563, Compound I-202)
Affinity DataKi: <10nM. Assay description: An assay buffer containing GCN2 kinase and (RS)7 was prepared. 4.7 μL of this stock solution was placed per well of a black, low volume, 384-wel...
Ligand InfoPC cidPC sid
In DepthDetails US Patent
TargeteIF-2-alpha kinase GCN2(Homo sapiens (Human))
Merck Patent
US Patent
LigandPNGBDBM464788(US10793563, Compound I-202)
Affinity DataIC50: <10nM. Assay description: An assay buffer containing GCN2 kinase and (RS)7 was prepared. 4.7 μL of this stock solution was placed per well of a black, low volume, 384-wel...
Ligand InfoPC cidPC sid
In DepthDetails US Patent