BDBM46480 2-[5-(4-bromophenyl)thieno[2,3-d]pyrimidin-4-yl]sulfanylacetic acid::2-[5-(4-bromophenyl)thieno[2,3-d]pyrimidin-4-yl]sulfanylethanoic acid::2-[[5-(4-bromophenyl)-4-thieno[2,3-d]pyrimidinyl]thio]acetic acid::2-[[5-(4-bromophenyl)thieno[2,3-d]pyrimidin-4-yl]thio]acetic acid::MLS000693838::SMR000300175::cid_1191742::{[5-(4-bromophenyl)thieno[2,3-d]pyrimidin-4-yl]thio}acetic acid
SMILES OC(=O)CSc1ncnc2scc(-c3ccc(Br)cc3)c12
InChI Key InChIKey=OFSQPNMSDPKEQI-UHFFFAOYSA-N
Data  2 EC50
  Tab Delimited (TSV)   2D SDfile   Computed 3D by Vconf -m prep SDfile
Find this compound or compounds like it in BindingDB:
Activity Spreadsheet -- Enzyme Inhibition Constant Data from BindingDB
Found 2 hits for monomerid = 46480
TargetEukaryotic translation initiation factor 2-alpha kinase 3(Homo sapiens (Human))
The Scripps Research Institute Molecular Screening Center
Curated by PubChem BioAssay
LigandPNGBDBM46480(2-[5-(4-bromophenyl)thieno[2,3-d]pyrimidin-4-yl]su...)
Affinity DataEC50: >5.57E+4nM. Assay description: Source (MLPCN Center Name): The Scripps Research Institute Molecular Screening Center (SRIMSC) Center Affiliation: The Scripps Research Institute (TS...
In DepthDetails PCBioAssay
TargetEukaryotic translation initiation factor 2-alpha kinase 3(Homo sapiens (Human))
The Scripps Research Institute Molecular Screening Center
Curated by PubChem BioAssay
LigandPNGBDBM46480(2-[5-(4-bromophenyl)thieno[2,3-d]pyrimidin-4-yl]su...)
Affinity DataEC50: >5.57E+4nM. Assay description: Source (MLPCN Center Name): The Scripps Research Institute Molecular Screening Center (SRIMSC) Center Affiliation: The Scripps Research Institute (TS...
In DepthDetails PCBioAssay