BDBM46518 1-(2-Fluoro-benzoyl)-3-(2-oxo-2H-chromen-6-yl)-thiourea::2-fluoranyl-N-[(2-oxidanylidenechromen-6-yl)carbamothioyl]benzamide::2-fluoro-N-[(2-ketochromen-6-yl)thiocarbamoyl]benzamide::2-fluoro-N-[(2-oxochromen-6-yl)carbamothioyl]benzamide::2-fluoro-N-[[(2-oxo-1-benzopyran-6-yl)amino]-sulfanylidenemethyl]benzamide::MLS000333176::SMR000436599::cid_934228
SMILES Fc1ccccc1C(=O)NC(=S)Nc1ccc2oc(=O)ccc2c1
InChI Key InChIKey=SYHSUBPZDGVDHC-UHFFFAOYSA-N
Data  2 EC50
  Tab Delimited (TSV)   2D SDfile   Computed 3D by Vconf -m prep SDfile
Find this compound or compounds like it in BindingDB:
Activity Spreadsheet -- Enzyme Inhibition Constant Data from BindingDB
Found 2 hits for monomerid = 46518
TargetEukaryotic translation initiation factor 2-alpha kinase 3(Homo sapiens (Human))
The Scripps Research Institute Molecular Screening Center
Curated by PubChem BioAssay
LigandPNGBDBM46518(1-(2-Fluoro-benzoyl)-3-(2-oxo-2H-chromen-6-yl)-thi...)
Affinity DataEC50: >5.57E+4nM. Assay description: Source (MLPCN Center Name): The Scripps Research Institute Molecular Screening Center (SRIMSC) Center Affiliation: The Scripps Research Institute (TS...
In DepthDetails PCBioAssay
TargetEukaryotic translation initiation factor 2-alpha kinase 3(Homo sapiens (Human))
The Scripps Research Institute Molecular Screening Center
Curated by PubChem BioAssay
LigandPNGBDBM46518(1-(2-Fluoro-benzoyl)-3-(2-oxo-2H-chromen-6-yl)-thi...)
Affinity DataEC50: >5.57E+4nM. Assay description: Source (MLPCN Center Name): The Scripps Research Institute Molecular Screening Center (SRIMSC) Center Affiliation: The Scripps Research Institute (TS...
In DepthDetails PCBioAssay