BDBM465292 US10793564, Compound 81
SMILES C[C@@H](O)CN(CCCCc1ccc2CCCNc2n1)CC[C@H](Nc1ncncc1-c1ccccc1)C(O)=O
InChI Key InChIKey=NZXUOOZIPKZQIK-RLWLMLJZSA-N
Data  1 IC50
  Tab Delimited (TSV)   2D SDfile   Computed 3D by Vconf -m prep SDfile
Find this compound or compounds like it in BindingDB:
Activity Spreadsheet -- Enzyme Inhibition Constant Data from BindingDB
Found 1 hit for monomerid = 465292
TargetIntegrin alpha-5/beta-6(Homo sapiens (Human))
Pliant Therapeutics
US Patent
LigandPNGBDBM465292(US10793564, Compound 81)
Affinity DataIC50: <50nM. Assay description: Microplates were coated with recombinant human integrin αVβ6 (2 μg/mL) in PBS (100 μL/well 25° C., overnight). The coating soluti...
Ligand InfoPC cidPC sid
In DepthDetails US Patent