BDBM46532 MLS000834752::N'-(2-fluorophenyl)benzohydrazide::N'-(2-fluorophenyl)benzohydrazide::SMR000458370::cid_2812154
SMILES Fc1ccccc1NNC(=O)c1ccccc1
InChI Key InChIKey=MPOQIRAADPDYIU-UHFFFAOYSA-N
Data  2 EC50
  Tab Delimited (TSV)   2D SDfile   Computed 3D by Vconf -m prep SDfile
Find this compound or compounds like it in BindingDB:
Activity Spreadsheet -- Enzyme Inhibition Constant Data from BindingDB
Found 2 hits for monomerid = 46532
TargetEukaryotic translation initiation factor 2-alpha kinase 3(Homo sapiens (Human))
The Scripps Research Institute Molecular Screening Center
Curated by PubChem BioAssay
LigandPNGBDBM46532(MLS000834752 | N'-(2-fluorophenyl)benzohydrazi...)
Affinity DataEC50: >5.57E+4nM. Assay description: Source (MLPCN Center Name): The Scripps Research Institute Molecular Screening Center (SRIMSC) Center Affiliation: The Scripps Research Institute (TS...
In DepthDetails PCBioAssay
TargetEukaryotic translation initiation factor 2-alpha kinase 3(Homo sapiens (Human))
The Scripps Research Institute Molecular Screening Center
Curated by PubChem BioAssay
LigandPNGBDBM46532(MLS000834752 | N'-(2-fluorophenyl)benzohydrazi...)
Affinity DataEC50: >5.57E+4nM. Assay description: Source (MLPCN Center Name): The Scripps Research Institute Molecular Screening Center (SRIMSC) Center Affiliation: The Scripps Research Institute (TS...
In DepthDetails PCBioAssay