BDBM465541 US10793568, Compound I-191
SMILES CCCCCS(=O)(=O)NC(=O)c1ccc(N2C[C@@H]3C[C@H]2C[C@H]3OCc2c(onc2-c2c(Cl)cccc2Cl)C2CC2)c(F)c1
InChI Key InChIKey=BDRUZPJWKDTTKO-NOMHHCBYSA-N
Data  1 EC50
  Tab Delimited (TSV)   2D SDfile   Computed 3D by Vconf -m prep SDfile
Find this compound or compounds like it in BindingDB:
Activity Spreadsheet -- Enzyme Inhibition Constant Data from BindingDB
Found 1 hit for monomerid = 465541
TargetBile acid receptor(Homo sapiens (Human))
Ardelyx
US Patent
LigandPNGBDBM465541(US10793568, Compound I-191)
Affinity DataEC50:  3.98nM. Assay description: The affinity of FXR ligands for the ligand binding domain of FXR was determined using a commercially available human FXR ligand binding assay (Lantha...
Ligand InfoPC cidPC sid
In DepthDetails US Patent