BDBM46556 (5Z)-5-[2-[(4-methyl-2-oxido-furazan-2-ium-3-yl)methoxy]benzylidene]-2-thioxo-4-imidazolidinone::(5Z)-5-[[2-[(4-methyl-2-oxidanidyl-1,2,5-oxadiazol-2-ium-3-yl)methoxy]phenyl]methylidene]-2-sulfanylidene-imidazolidin-4-one::(5Z)-5-[[2-[(4-methyl-2-oxido-1,2,5-oxadiazol-2-ium-3-yl)methoxy]phenyl]methylidene]-2-sulfanylidene-4-imidazolidinone::(5Z)-5-[[2-[(4-methyl-2-oxido-1,2,5-oxadiazol-2-ium-3-yl)methoxy]phenyl]methylidene]-2-sulfanylideneimidazolidin-4-one::5-{2-[(4-methyl-2-oxido-1,2,5-oxadiazol-3-yl)methoxy]benzylidene}-2-thioxo-4-imidazolidinone::MLS000533696::SMR000141074::cid_2264155
SMILES Cc1n[o+]n([O-])c1COc1ccccc1\C=C1/NC(=S)NC1=O
InChI Key InChIKey=BJGFRUXVBYNCNU-POHAHGRESA-N
Data  2 IC50
  Tab Delimited (TSV)   2D SDfile   Computed 3D by Vconf -m prep SDfile
Find this compound or compounds like it in BindingDB:
Activity Spreadsheet -- Enzyme Inhibition Constant Data from BindingDB
Found 2 hits for monomerid = 46556
TargetTransitional endoplasmic reticulum ATPase(Homo sapiens (Human))
The Scripps Research Institute Molecular Screening Center
Curated by PubChem BioAssay
LigandPNGBDBM46556((5Z)-5-[2-[(4-methyl-2-oxido-furazan-2-ium-3-yl)me...)
Affinity DataIC50: >5.00E+4nM. Assay description: Source (MLPCN Center Name): The Scripps Research Institute Molecular Screening Center Center Affiliation: The Scripps Research Institute (TSRI) Assay...
In DepthDetails PCBioAssay
TargetTransitional endoplasmic reticulum ATPase(Homo sapiens (Human))
The Scripps Research Institute Molecular Screening Center
Curated by PubChem BioAssay
LigandPNGBDBM46556((5Z)-5-[2-[(4-methyl-2-oxido-furazan-2-ium-3-yl)me...)
Affinity DataIC50: >5.00E+4nM. Assay description: Source (MLPCN Center Name): The Scripps Research Institute Molecular Screening Center Center Affiliation: The Scripps Research Institute (TSRI) Assay...
In DepthDetails PCBioAssay