BDBM46561 3-(N'-p-anisylidenehydrazino)-6-phenyl-2H-1,2,4-triazin-5-one::3-[2-[(4-methoxyphenyl)methylidene]hydrazinyl]-6-phenyl-2H-1,2,4-triazin-5-one::4-methoxybenzaldehyde (5-oxo-6-phenyl-4,5-dihydro-1,2,4-triazin-3-yl)hydrazone::MLS000577703::SMR000187086::cid_2867539
SMILES COc1ccc(CN=Nc2nnc(-c3ccccc3)c(=O)[nH]2)cc1
InChI Key InChIKey=IUHDKMLRDXXGIF-UHFFFAOYSA-N
Data  2 IC50
  Tab Delimited (TSV)   2D SDfile   Computed 3D by Vconf -m prep SDfile
Find this compound or compounds like it in BindingDB:
Activity Spreadsheet -- Enzyme Inhibition Constant Data from BindingDB
Found 2 hits for monomerid = 46561
TargetTransitional endoplasmic reticulum ATPase(Homo sapiens (Human))
The Scripps Research Institute Molecular Screening Center
Curated by PubChem BioAssay
LigandPNGBDBM46561(3-(N'-p-anisylidenehydrazino)-6-phenyl-2H-1,2,4-tr...)
Affinity DataIC50: >5.00E+4nM. Assay description: Source (MLPCN Center Name): The Scripps Research Institute Molecular Screening Center Center Affiliation: The Scripps Research Institute (TSRI) Assay...
Ligand InfoPC cidPC sid
In DepthDetails PCBioAssay
TargetTransitional endoplasmic reticulum ATPase(Homo sapiens (Human))
The Scripps Research Institute Molecular Screening Center
Curated by PubChem BioAssay
LigandPNGBDBM46561(3-(N'-p-anisylidenehydrazino)-6-phenyl-2H-1,2,4-tr...)
Affinity DataIC50: >5.00E+4nM. Assay description: Source (MLPCN Center Name): The Scripps Research Institute Molecular Screening Center Center Affiliation: The Scripps Research Institute (TSRI) Assay...
Ligand InfoPC cidPC sid
In DepthDetails PCBioAssay