BDBM465707 US10793568, Compound I-358
SMILES OC(=O)CNC(=O)c1ccc(cc1)N1[C@@H]2C[C@@H](OCc3c(onc3-c3c(Cl)cccc3Cl)C3CC3)[C@@H](C2)C1=O
InChI Key InChIKey=QPQMGLZPSVFBKN-NJNPRVFISA-N
Data  1 EC50
  Tab Delimited (TSV)   2D SDfile   Computed 3D by Vconf -m prep SDfile
Find this compound or compounds like it in BindingDB:
Activity Spreadsheet -- Enzyme Inhibition Constant Data from BindingDB
Found 1 hit for monomerid = 465707
TargetBile acid receptor(Homo sapiens (Human))
Ardelyx
US Patent
LigandPNGBDBM465707(US10793568, Compound I-358)
Affinity DataEC50:  10nM. Assay description: The affinity of FXR ligands for the ligand binding domain of FXR was determined using a commercially available human FXR ligand binding assay (Lantha...
Ligand InfoPC cidPC sid
In DepthDetails US Patent