BDBM465786 US10793576, Example 18
SMILES CC(=O)N1CC2C[C@H]1C(N2C(=O)C=C)c1nc(-c2ccc(cc2)C(=O)Nc2ccccn2)c2c(N)nccn12
InChI Key InChIKey=AWFFXPWUPWWAKU-VIHQBZHPSA-N
Data  1 IC50
  Tab Delimited (TSV)   2D SDfile   Computed 3D by Vconf -m prep SDfile
Find this compound or compounds like it in BindingDB:
Activity Spreadsheet -- Enzyme Inhibition Constant Data from BindingDB
Found 1 hit for monomerid = 465786
TargetTyrosine-protein kinase BTK(Homo sapiens (Human))
Chengdu Brilliant Pharmaceutical
US Patent
LigandPNGBDBM465786(US10793576, Example 18)
Affinity DataIC50:  1.40nM. Assay description: 1: Test Principle:Mobility-Shift Assay, which is microfluidic chip technology, applies the basic concept of capillary electrophoresis to microfluidic...
Ligand InfoPC cidPC sid
In DepthDetails US Patent