BDBM465810 US10793576, Example 42
SMILES Nc1nccn2c(nc(-c3ccc(cc3)C(=O)Nc3cc(ccn3)C(F)(F)F)c12)C1C2CCCC2CN1C(=O)C=C
InChI Key InChIKey=CHYCFFIOIFJXOZ-UHFFFAOYSA-N
Data  1 IC50
  Tab Delimited (TSV)   2D SDfile   Computed 3D by Vconf -m prep SDfile
Find this compound or compounds like it in BindingDB:
Activity Spreadsheet -- Enzyme Inhibition Constant Data from BindingDB
Found 1 hit for monomerid = 465810
TargetTyrosine-protein kinase BTK(Homo sapiens (Human))
Chengdu Brilliant Pharmaceutical
US Patent
LigandPNGBDBM465810(US10793576, Example 42)
Affinity DataIC50:  5.30nM. Assay description: 1: Test Principle:Mobility-Shift Assay, which is microfluidic chip technology, applies the basic concept of capillary electrophoresis to microfluidic...
Ligand InfoPC cidPC sid
In DepthDetails US Patent