BDBM46583 4-Isopropyl-2,3-dihydro-1H-6-thia-5,8,10-triaza-cyclopenta[c]fluorene-7-thiol::MLS000769554::SMR000434286::cid_930238
SMILES CC(C)c1nc2sc3c([nH]cnc3=S)c2c2CCCc12
InChI Key InChIKey=QKMABHWGFYVEHK-UHFFFAOYSA-N
Data  2 IC50
  Tab Delimited (TSV)   2D SDfile   Computed 3D by Vconf -m prep SDfile
Find this compound or compounds like it in BindingDB:
Activity Spreadsheet -- Enzyme Inhibition Constant Data from BindingDB
Found 2 hits for monomerid = 46583
TargetTransitional endoplasmic reticulum ATPase(Homo sapiens (Human))
The Scripps Research Institute Molecular Screening Center
Curated by PubChem BioAssay
LigandPNGBDBM46583(4-Isopropyl-2,3-dihydro-1H-6-thia-5,8,10-triaza-cy...)
Affinity DataIC50:  4.22E+4nM. Assay description: Source (MLPCN Center Name): The Scripps Research Institute Molecular Screening Center Center Affiliation: The Scripps Research Institute (TSRI) Assay...
In DepthDetails PCBioAssay
TargetTransitional endoplasmic reticulum ATPase(Homo sapiens (Human))
The Scripps Research Institute Molecular Screening Center
Curated by PubChem BioAssay
LigandPNGBDBM46583(4-Isopropyl-2,3-dihydro-1H-6-thia-5,8,10-triaza-cy...)
Affinity DataIC50: >5.00E+4nM. Assay description: Source (MLPCN Center Name): The Scripps Research Institute Molecular Screening Center Center Affiliation: The Scripps Research Institute (TSRI) Assay...
In DepthDetails PCBioAssay