BDBM465852 US10793576, Example 84
SMILES CC(O)(c1ccccc1)c1ccc(cc1)-c1nc(n2ccnc(N)c12)C12CCC(COC1)N2C(=O)C=C
InChI Key InChIKey=ZZGZHEUYWGNHPY-UHFFFAOYSA-N
Data  1 IC50
  Tab Delimited (TSV)   2D SDfile   Computed 3D by Vconf -m prep SDfile
Find this compound or compounds like it in BindingDB:
Activity Spreadsheet -- Enzyme Inhibition Constant Data from BindingDB
Found 1 hit for monomerid = 465852
TargetTyrosine-protein kinase BTK(Homo sapiens (Human))
Chengdu Brilliant Pharmaceutical
US Patent
LigandPNGBDBM465852(US10793576, Example 84)
Affinity DataIC50:  16.3nM. Assay description: 1: Test Principle:Mobility-Shift Assay, which is microfluidic chip technology, applies the basic concept of capillary electrophoresis to microfluidic...
Ligand InfoPC cidPC sid
In DepthDetails US Patent