BDBM465855 US10793576, Example 87
SMILES CC#CC(=O)N1C2CN[C@@H](C2)C1c1nc(-c2ccc(cc2)C(C)(O)c2ccccc2)c2c(N)nccn12
InChI Key InChIKey=GRJAHKRTAVPFKP-JLBUTAKDSA-N
Data  1 IC50
  Tab Delimited (TSV)   2D SDfile   Computed 3D by Vconf -m prep SDfile
Find this compound or compounds like it in BindingDB:
Activity Spreadsheet -- Enzyme Inhibition Constant Data from BindingDB
Found 1 hit for monomerid = 465855
TargetTyrosine-protein kinase BTK(Homo sapiens (Human))
Chengdu Brilliant Pharmaceutical
US Patent
LigandPNGBDBM465855(US10793576, Example 87)
Affinity DataIC50:  42nM. Assay description: 1: Test Principle:Mobility-Shift Assay, which is microfluidic chip technology, applies the basic concept of capillary electrophoresis to microfluidic...
Ligand InfoPC cidPC sid
In DepthDetails US Patent