BDBM46586 Acetic acid 4,4,6-trimethyl-2-oxo-1-[4-oxo-2-thioxo-thiazolidin-(5Z)-ylidene]-1,2-dihydro-4H-pyrrolo[3,2,1-ij]quinolin- 8-yl ester::MLS000332290::SMR000435024::cid_1613528
SMILES CC(=O)Oc1cc2\C(C(=O)N3c2c(c1)C(C)=CC3(C)C)=C1\SC(=S)NC1=O
InChI Key InChIKey=SKCXBEBNJYIATC-SQFISAMPSA-N
Data  2 IC50
  Tab Delimited (TSV)   2D SDfile   Computed 3D by Vconf -m prep SDfile
Find this compound or compounds like it in BindingDB:
Activity Spreadsheet -- Enzyme Inhibition Constant Data from BindingDB
Found 2 hits for monomerid = 46586
TargetTransitional endoplasmic reticulum ATPase(Homo sapiens (Human))
The Scripps Research Institute Molecular Screening Center
Curated by PubChem BioAssay
LigandPNGBDBM46586(Acetic acid 4,4,6-trimethyl-2-oxo-1-[4-oxo-2-thiox...)
Affinity DataIC50: >5.00E+4nM. Assay description: Source (MLPCN Center Name): The Scripps Research Institute Molecular Screening Center Center Affiliation: The Scripps Research Institute (TSRI) Assay...
In DepthDetails PCBioAssay
TargetTransitional endoplasmic reticulum ATPase(Homo sapiens (Human))
The Scripps Research Institute Molecular Screening Center
Curated by PubChem BioAssay
LigandPNGBDBM46586(Acetic acid 4,4,6-trimethyl-2-oxo-1-[4-oxo-2-thiox...)
Affinity DataIC50: >5.00E+4nM. Assay description: Source (MLPCN Center Name): The Scripps Research Institute Molecular Screening Center Center Affiliation: The Scripps Research Institute (TSRI) Assay...
In DepthDetails PCBioAssay