BDBM465865 US10793576, Example 97
SMILES CC#CC(=O)N1CC2CCCC2C1c1nc(-c2ccc(Oc3ccccc3)cc2)c2c(N)nccn12
InChI Key InChIKey=ZGIRFYXXDBJBSR-UHFFFAOYSA-N
Data  1 IC50
  Tab Delimited (TSV)   2D SDfile   Computed 3D by Vconf -m prep SDfile
Find this compound or compounds like it in BindingDB:
Activity Spreadsheet -- Enzyme Inhibition Constant Data from BindingDB
Found 1 hit for monomerid = 465865
TargetTyrosine-protein kinase BTK(Homo sapiens (Human))
Chengdu Brilliant Pharmaceutical
US Patent
LigandPNGBDBM465865(US10793576, Example 97)
Affinity DataIC50:  2.80nM. Assay description: 1: Test Principle:Mobility-Shift Assay, which is microfluidic chip technology, applies the basic concept of capillary electrophoresis to microfluidic...
Ligand InfoPC cidPC sid
In DepthDetails US Patent