BDBM46595 4-[(6-methyl-2,5-dihydropyrazolo[1,5-b][1,2,4]thiadiazol-2-yl)amino]benzoic acid ethyl ester::MLS-0241060.0001::cid_5293704::ethyl 4-[(6-methyl-2,5-dihydropyrazolo[1,5-b][1,2,4]thiadiazol-2-yl)amino]benzoate
SMILES CCOC(=O)c1ccc(NC2Nc3cc(C)nn3S2)cc1
InChI Key InChIKey=QLRGAWGWXHRWHN-UHFFFAOYSA-N
Data  2 IC50
  Tab Delimited (TSV)   2D SDfile   Computed 3D by Vconf -m prep SDfile
Find this compound or compounds like it in BindingDB:
Activity Spreadsheet -- Enzyme Inhibition Constant Data from BindingDB
Found 2 hits for monomerid = 46595
TargetMannose-6-phosphate isomerase(Homo sapiens (Human))
Burnham Center For Chemical Genomics
Curated by PubChem BioAssay
LigandPNGBDBM46595(4-[(6-methyl-2,5-dihydropyrazolo[1,5-b][1,2,4]thia...)
Affinity DataIC50: >5.00E+4nM. Assay description: Data Source: Sanford-Burnham Center for Chemical Genomics (SBCCG) Source Affiliation: Sanford-Burnham Medical Research Institute (SBMRI, San Diego, C...
In DepthDetails PCBioAssay
TargetPhosphomannomutase 2(Homo sapiens (Human))
Burnham Center For Chemical Genomics
Curated by PubChem BioAssay
LigandPNGBDBM46595(4-[(6-methyl-2,5-dihydropyrazolo[1,5-b][1,2,4]thia...)
Affinity DataIC50: >1.00E+5nM. Assay description: Data Source: Sanford-Burnham Center for Chemical Genomics (SBCCG) Source Affiliation: Sanford-Burnham Medical Research Institute (SBMRI, San Diego, C...
In DepthDetails PCBioAssay