BDBM466243 US10793582, Example 38
SMILES COCCN([C@H](C)C(=O)NCc1ccccc1)c1nc2ncnc(C3CC3)c2s1
InChI Key InChIKey=DZJWODFOEYFFEC-CQSZACIVSA-N
Data  1 IC50
  Tab Delimited (TSV)   2D SDfile   Computed 3D by Vconf -m prep SDfile
Find this compound or compounds like it in BindingDB:
Activity Spreadsheet -- Enzyme Inhibition Constant Data from BindingDB
Found 1 hit for monomerid = 466243
TargetKynurenine/alpha-aminoadipate aminotransferase, mitochondrial(Homo sapiens (Human))
Mitsubishi Tanabe Pharma
US Patent
LigandPNGBDBM466243(US10793582, Example 38)
Affinity DataIC50:  410nM. Assay description: To a reaction mixture (45 μL) containing 3.0 μmol/L kynurenine, 10 μmol/L pyridoxal phosphate, 2.0 ng/μL human recombinant KAT-II...
Ligand InfoPC cidPC sid
In DepthDetails US Patent