BDBM466298 (R)—N-benzyl-1-{7-cyclopropyl-6-[(dimethylamino)methyl][1,3]thiazolo[4,5-b]pyridin-2-yl}pyrrolidine-2-carboxamide hydrochloride::US10793582, Example 176
SMILES CN(C)Cc1cnc2nc(sc2c1C1CC1)N1CCC[C@@H]1C(=O)NCc1ccccc1
InChI Key InChIKey=ZTSZYACXMWJHSR-LJQANCHMSA-N
Data  1 IC50
  Tab Delimited (TSV)   2D SDfile   Computed 3D by Vconf -m prep SDfile
Find this compound or compounds like it in BindingDB:
Activity Spreadsheet -- Enzyme Inhibition Constant Data from BindingDB
Found 1 hit for monomerid = 466298
TargetKynurenine/alpha-aminoadipate aminotransferase, mitochondrial(Homo sapiens (Human))
Mitsubishi Tanabe Pharma
US Patent
LigandPNGBDBM466298((R)—N-benzyl-1-{7-cyclopropyl-6-[(dimethylami...)
Affinity DataIC50:  190nM. Assay description: To a reaction mixture (45 μL) containing 3.0 μmol/L kynurenine, 10 μmol/L pyridoxal phosphate, 2.0 ng/μL human recombinant KAT-II...
Ligand InfoPC cidPC sid
In DepthDetails US Patent