BDBM466340 US10799494, Example WDH-2G-6
SMILES CC(C)c1c([nH]c2ccccc2c1=O)-c1cnn(Cc2ccc(OC(F)(F)F)cc2)c1
InChI Key InChIKey=QPOJABZPAWVFFG-UHFFFAOYSA-N
Data  1 IC50
  Tab Delimited (TSV)   2D SDfile   Computed 3D by Vconf -m prep SDfile
Find this compound or compounds like it in BindingDB:
Activity Spreadsheet -- Enzyme Inhibition Constant Data from BindingDB
Found 1 hit for monomerid = 466340
LigandPNGBDBM466340(US10799494, Example WDH-2G-6)
Affinity DataIC50:  82nM. Assay description: The Mtb cytochrome bd inhibition assay described in accompanying Example section, or elsewhere in the literature, may be used to measure the pharmaco...
Ligand InfoPC cidPC sid
In DepthDetails US Patent