BDBM466358 (8S)-N-[(4-cyano- 3-fluoro- phenyl)methyl]-5- (7H-pyrrolo[2,3- d]pyrimidin-4-yl)- 5-azaspiro [2.5]octane- 8-carboxamide::US10799507, Example 16
SMILES Fc1cc(CNC(=O)[C@H]2CCN(CC22CC2)c2ncnc3[nH]ccc23)ccc1C#N
InChI Key
Data  4 EC50
  Tab Delimited (TSV)   2D SDfile   Computed 3D by Vconf -m prep SDfile
Find this compound or compounds like it in BindingDB:
Activity Spreadsheet -- Enzyme Inhibition Constant Data from BindingDB
Found 4 hits for monomerid = 466358
TargetTyrosine-protein kinase JAK1(Homo sapiens (Human))
Leo Pharma
US Patent
LigandPNGBDBM466358((8S)-N-[(4-cyano- 3-fluoro- phenyl)methyl]-5- (7H-...)
Affinity DataEC50:  1nM. Assay description: Human baculovirus-expressed JAK1, 2, 3 and TYK2 were purchased from Carna Biosciences, Inc. All four purified enzymes contain only the catalytic doma...
Ligand InfoPC cidPC sid
In DepthDetails US Patent
TargetNon-receptor tyrosine-protein kinase TYK2(Homo sapiens (Human))
Leo Pharma
US Patent
LigandPNGBDBM466358((8S)-N-[(4-cyano- 3-fluoro- phenyl)methyl]-5- (7H-...)
Affinity DataEC50:  44.3nM. Assay description: Human baculovirus-expressed JAK1, 2, 3 and TYK2 were purchased from Carna Biosciences, Inc. All four purified enzymes contain only the catalytic doma...
Ligand InfoPC cidPC sid
In DepthDetails US Patent
TargetTyrosine-protein kinase JAK3(Homo sapiens (Human))
Leo Pharma
US Patent
LigandPNGBDBM466358((8S)-N-[(4-cyano- 3-fluoro- phenyl)methyl]-5- (7H-...)
Affinity DataEC50:  7.10nM. Assay description: Human baculovirus-expressed JAK1, 2, 3 and TYK2 were purchased from Carna Biosciences, Inc. All four purified enzymes contain only the catalytic doma...
Ligand InfoPC cidPC sid
In DepthDetails US Patent
TargetTyrosine-protein kinase JAK2(Homo sapiens (Human))
Leo Pharma
US Patent
LigandPNGBDBM466358((8S)-N-[(4-cyano- 3-fluoro- phenyl)methyl]-5- (7H-...)
Affinity DataEC50:  3.60nM. Assay description: Human baculovirus-expressed JAK1, 2, 3 and TYK2 were purchased from Carna Biosciences, Inc. All four purified enzymes contain only the catalytic doma...
Ligand InfoPC cidPC sid
In DepthDetails US Patent