BDBM466363 N-[(1S)-1-(4- cyanophenyl) ethyl]-5-(7H- pyrrolo[2,3- d]pyrimidin-4-yl)- 5-azaspiro [2.5]octane- 8-carboxamide::US10799507, Example 21
SMILES C[C@H](NC(=O)C1CCN(CC11CC1)c1ncnc2[nH]ccc12)c1ccc(cc1)C#N
InChI Key
Data  4 EC50
  Tab Delimited (TSV)   2D SDfile   Computed 3D by Vconf -m prep SDfile
Find this compound or compounds like it in BindingDB:
Activity Spreadsheet -- Enzyme Inhibition Constant Data from BindingDB
Found 4 hits for monomerid = 466363
TargetTyrosine-protein kinase JAK1(Homo sapiens (Human))
Leo Pharma
US Patent
LigandPNGBDBM466363(N-[(1S)-1-(4- cyanophenyl) ethyl]-5-(7H- pyrrolo[2...)
Affinity DataEC50:  1.10nM. Assay description: Human baculovirus-expressed JAK1, 2, 3 and TYK2 were purchased from Carna Biosciences, Inc. All four purified enzymes contain only the catalytic doma...
Ligand InfoPC cidPC sid
In DepthDetails US Patent
TargetNon-receptor tyrosine-protein kinase TYK2(Homo sapiens (Human))
Leo Pharma
US Patent
LigandPNGBDBM466363(N-[(1S)-1-(4- cyanophenyl) ethyl]-5-(7H- pyrrolo[2...)
Affinity DataEC50:  52.1nM. Assay description: Human baculovirus-expressed JAK1, 2, 3 and TYK2 were purchased from Carna Biosciences, Inc. All four purified enzymes contain only the catalytic doma...
Ligand InfoPC cidPC sid
In DepthDetails US Patent
TargetTyrosine-protein kinase JAK3(Homo sapiens (Human))
Leo Pharma
US Patent
LigandPNGBDBM466363(N-[(1S)-1-(4- cyanophenyl) ethyl]-5-(7H- pyrrolo[2...)
Affinity DataEC50:  7.70nM. Assay description: Human baculovirus-expressed JAK1, 2, 3 and TYK2 were purchased from Carna Biosciences, Inc. All four purified enzymes contain only the catalytic doma...
Ligand InfoPC cidPC sid
In DepthDetails US Patent
TargetTyrosine-protein kinase JAK2(Homo sapiens (Human))
Leo Pharma
US Patent
LigandPNGBDBM466363(N-[(1S)-1-(4- cyanophenyl) ethyl]-5-(7H- pyrrolo[2...)
Affinity DataEC50:  2.5nM. Assay description: Human baculovirus-expressed JAK1, 2, 3 and TYK2 were purchased from Carna Biosciences, Inc. All four purified enzymes contain only the catalytic doma...
Ligand InfoPC cidPC sid
In DepthDetails US Patent