BDBM466505 US10799605, Example 19
SMILES COc1cccc(OC)c1-c1cc(nn1-c1ccc(cc1C(C)C)C(=O)N(CCCNC(=O)CN1CCN(CC(O)=O)CCN(CC(O)=O)CCN(CC(O)=O)CC1)CCCN(C)C)C(=O)NC1(C2CC3CC(C2)CC1C3)C(O)=O
InChI Key InChIKey=YRIFAMIPLREWQV-UHFFFAOYSA-N
Data  2 IC50
  Tab Delimited (TSV)   2D SDfile   Computed 3D by Vconf -m prep SDfile
Find this compound or compounds like it in BindingDB:
Activity Spreadsheet -- Enzyme Inhibition Constant Data from BindingDB
Found 2 hits for monomerid = 466505
TargetNeurotensin receptor type 1(Homo sapiens (Human))
3B Pharmaceuticals
US Patent
LigandPNGBDBM466505(US10799605, Example 19)
Affinity DataIC50:  3.40nM. Assay description: In order to determine the binding affinity of compounds comprising a radiolabel for NTR1, a radioligand binding assay was carried out. A radioligand ...
Ligand InfoPC cidPC sid
In DepthDetails US Patent
TargetNeurotensin receptor type 1(Homo sapiens (Human))
3B Pharmaceuticals
US Patent
LigandPNGBDBM466505(US10799605, Example 19)
Affinity DataIC50:  12.6nM. Assay description: Ca2+ ions are usually kept at nanomolar levels in the cytosol of cells, and act in a number of signal transduction pathways as second messengers. Man...
Ligand InfoPC cidPC sid
In DepthDetails US Patent