BDBM466584 N-(2-{4-[6-(Dimethylamino)pyridin-2-yl]piperidin-1-yl}ethyl)-tetrahydro-2H-pyran-4-carboxamide::US10800755, Example 38::US11014905, Example 38
SMILES CN(C)c1cccc(n1)C1CCN(CCNC(=O)C2CCOCC2)CC1
InChI Key InChIKey=CRPFIYXBQORQJX-UHFFFAOYSA-N
Data  3 KI  4 IC50  2 EC50
  Tab Delimited (TSV)   2D SDfile   Computed 3D by Vconf -m prep SDfile
Find this compound or compounds like it in BindingDB:
Activity Spreadsheet -- Enzyme Inhibition Constant Data from BindingDB
Found 9 hits for monomerid = 466584
TargetD(4) dopamine receptor(Homo sapiens (Human))
Sumitomo Dainippon Pharma
US Patent
LigandPNGBDBM466584(N-(2-{4-[6-(Dimethylamino)pyridin-2-yl]piperidin-1...)
Affinity DataKi:  10nM. Assay description: The binding affinity of the present compounds to human 5-HT1A receptor, human D4 receptor, and human D2 receptor was measured in a manner mentioned b...
Ligand InfoPC cidPC sid
In DepthDetails US Patent
TargetD(2) dopamine receptor(Homo sapiens (Human))
Sumitomo Dainippon Pharma
US Patent
LigandPNGBDBM466584(N-(2-{4-[6-(Dimethylamino)pyridin-2-yl]piperidin-1...)
Affinity DataKi:  37nM. Assay description: The binding affinity of the present compounds to human 5-HT1A receptor, human D4 receptor, and human D2 receptor was measured in a manner mentioned b...
Ligand InfoPC cidPC sid
In DepthDetails US Patent
Target5-hydroxytryptamine receptor 1A(Homo sapiens (Human))
Sumitomo Dainippon Pharma
US Patent
LigandPNGBDBM466584(N-(2-{4-[6-(Dimethylamino)pyridin-2-yl]piperidin-1...)
Affinity DataKi: >1.00E+4nM. Assay description: The binding affinity of the present compounds to human 5-HT1A receptor, human D4 receptor, and human D2 receptor was measured in a manner mentioned b...
Ligand InfoPC cidPC sid
In DepthDetails US Patent
TargetD(4) dopamine receptor(Homo sapiens (Human))
Sumitomo Dainippon Pharma
US Patent
LigandPNGBDBM466584(N-(2-{4-[6-(Dimethylamino)pyridin-2-yl]piperidin-1...)
Affinity DataIC50:  10nM. Assay description: The binding affinity of the present compounds to human 5-HT1A receptor, human D4 receptor, and human D2 receptor was measured in a manner mentioned b...
Ligand InfoPC cidPC sid
In DepthDetails US Patent
TargetPotassium voltage-gated channel subfamily H member 2(Homo sapiens (Human))
Sumitomo Dainippon Pharma
US Patent
LigandPNGBDBM466584(N-(2-{4-[6-(Dimethylamino)pyridin-2-yl]piperidin-1...)
Affinity DataIC50: >1.00E+4nM. Assay description: The activity of the present compound for inhibiting hERG channel was measured by whole-cell patch clamp method with auto patch clamp system, using CH...
Ligand InfoPC cidPC sid
In DepthDetails US Patent
Target5-hydroxytryptamine receptor 1A(Homo sapiens (Human))
Sumitomo Dainippon Pharma
US Patent
LigandPNGBDBM466584(N-(2-{4-[6-(Dimethylamino)pyridin-2-yl]piperidin-1...)
Affinity DataIC50:  37nM. Assay description: The binding affinity of the present compounds to human 5-HT1A receptor, human D4 receptor, and human D2 receptor was measured in a manner mentioned b...
Ligand InfoPC cidPC sid
In DepthDetails US Patent
TargetD(4) dopamine receptor(Homo sapiens (Human))
Sumitomo Dainippon Pharma
US Patent
LigandPNGBDBM466584(N-(2-{4-[6-(Dimethylamino)pyridin-2-yl]piperidin-1...)
Affinity DataEC50:  42nM. Assay description: Aequorin, Gα16 proteins, and each receptor were transiently expressed in CHO-K1 cell (Chinese hamster ovary), and seeded to 384-well plate. The ...
Ligand InfoPC cidPC sid
In DepthDetails US Patent
Target5-hydroxytryptamine receptor 1A(Homo sapiens (Human))
Sumitomo Dainippon Pharma
US Patent
LigandPNGBDBM466584(N-(2-{4-[6-(Dimethylamino)pyridin-2-yl]piperidin-1...)
Affinity DataEC50:  86nM. Assay description: Aequorin, Gα16 proteins, and each receptor were transiently expressed in CHO-K1 cell (Chinese hamster ovary), and seeded to 384-well plate. The ...
Ligand InfoPC cidPC sid
In DepthDetails US Patent
TargetD(2) dopamine receptor(Homo sapiens (Human))
Sumitomo Dainippon Pharma
US Patent
LigandPNGBDBM466584(N-(2-{4-[6-(Dimethylamino)pyridin-2-yl]piperidin-1...)
Affinity DataIC50: >1.00E+4nM. Assay description: The binding affinity of the present compounds to human 5-HT1A receptor, human D4 receptor, and human D2 receptor was measured in a manner mentioned b...
Ligand InfoPC cidPC sid
In DepthDetails US Patent