BDBM466603 (6-Amino-4-methoxy-3',4',5',6'- tetrahydro-2'H-[3,4']bipyridinyl-1'-yl)- [5-(2-fluoro-benzyloxy)-4-methoxy- pyridin-2-yl]-methanone::US10800757, Compound 19::US10889568, Compound 19
SMILES COc1cc(ncc1OCc1ccccc1F)C(=O)N1CCC(CC1)c1cnc(N)cc1OC
InChI Key InChIKey=NZJDPNKBNSXPSQ-UHFFFAOYSA-N
Data  2 IC50
  Tab Delimited (TSV)   2D SDfile   Computed 3D by Vconf -m prep SDfile
Find this compound or compounds like it in BindingDB:
Activity Spreadsheet -- Enzyme Inhibition Constant Data from BindingDB
Found 2 hits for monomerid = 466603
TargetShort transient receptor potential channel 6(Homo sapiens (Human))
Boehringer Ingelheim International
US Patent
LigandPNGBDBM466603((6-Amino-4-methoxy-3',4',5',6'- tetrahydro-2'H-[3,...)
Affinity DataIC50:  32nM. Assay description: This screening assay measures TRPC6 (transient receptor potential cation channel, subfamily C, member 6) ion channel activation via addition either o...
Ligand InfoPC cidPC sid
In DepthDetails US Patent
TargetShort transient receptor potential channel 6(Homo sapiens (Human))
Boehringer Ingelheim International
US Patent
LigandPNGBDBM466603((6-Amino-4-methoxy-3',4',5',6'- tetrahydro-2'H-[3,...)
Affinity DataIC50:  32nM. Assay description: The commercially available HEK293/TREx line (Invitrogen) was stably transfected with a TRPC6 construct and screened by conventional calcium imaging t...
Ligand InfoPC cidPC sid
In DepthDetails US Patent