BDBM466644 US10800757, Compound 60::US10889568, Compound 60::[4-(6-Amino-5-methoxy-pyridazin-3- yl)-piperidin-1-yl]-[4-methoxy-5-(4- methoxy-phenoxy)-pyridin-2-yl]- methanone
SMILES COc1ccc(Oc2cnc(cc2OC)C(=O)N2CCC(CC2)c2cc(OC)c(N)nn2)cc1
InChI Key InChIKey=SXUUYWYXKDESSR-UHFFFAOYSA-N
Data  2 IC50
  Tab Delimited (TSV)   2D SDfile   Computed 3D by Vconf -m prep SDfile
Find this compound or compounds like it in BindingDB:
Activity Spreadsheet -- Enzyme Inhibition Constant Data from BindingDB
Found 2 hits for monomerid = 466644
TargetShort transient receptor potential channel 6(Homo sapiens (Human))
Boehringer Ingelheim International
US Patent
LigandPNGBDBM466644(US10800757, Compound 60 | US10889568, Compound 60 ...)
Affinity DataIC50:  440nM. Assay description: This screening assay measures TRPC6 (transient receptor potential cation channel, subfamily C, member 6) ion channel activation via addition either o...
Ligand InfoPC cidPC sid
In DepthDetails US Patent
TargetShort transient receptor potential channel 6(Homo sapiens (Human))
Boehringer Ingelheim International
US Patent
LigandPNGBDBM466644(US10800757, Compound 60 | US10889568, Compound 60 ...)
Affinity DataIC50:  440nM. Assay description: The commercially available HEK293/TREx line (Invitrogen) was stably transfected with a TRPC6 construct and screened by conventional calcium imaging t...
Ligand InfoPC cidPC sid
In DepthDetails US Patent