BDBM46666 5-(4-methoxyphenyl)-1H-1,2,4-triazol-3-amine::MLS-0070117.0001::[5-(4-methoxyphenyl)-1H-1,2,4-triazol-3-yl]amine::cid_781002
SMILES COc1ccc(cc1)-c1nnc(N)[nH]1
InChI Key InChIKey=BKEAHUXWMIWWCP-UHFFFAOYSA-N
Data  2 IC50
  Tab Delimited (TSV)   2D SDfile   Computed 3D by Vconf -m prep SDfile
Find this compound or compounds like it in BindingDB:
Activity Spreadsheet -- Enzyme Inhibition Constant Data from BindingDB
Found 2 hits for monomerid = 46666
TargetMannose-6-phosphate isomerase(Homo sapiens (Human))
Burnham Center For Chemical Genomics
Curated by PubChem BioAssay
LigandPNGBDBM46666(5-(4-methoxyphenyl)-1H-1,2,4-triazol-3-amine | MLS...)
Affinity DataIC50: >5.00E+4nM. Assay description: Data Source: Sanford-Burnham Center for Chemical Genomics (SBCCG) Source Affiliation: Sanford-Burnham Medical Research Institute (SBMRI, San Diego, C...
In DepthDetails PCBioAssay
TargetPhosphomannomutase 2(Homo sapiens (Human))
Burnham Center For Chemical Genomics
Curated by PubChem BioAssay
LigandPNGBDBM46666(5-(4-methoxyphenyl)-1H-1,2,4-triazol-3-amine | MLS...)
Affinity DataIC50: >1.00E+5nM. Assay description: Data Source: Sanford-Burnham Center for Chemical Genomics (SBCCG) Source Affiliation: Sanford-Burnham Medical Research Institute (SBMRI, San Diego, C...
In DepthDetails PCBioAssay